OSEC

Neohapsis is currently accepting applications for employment. For more information, please visit our website www.neohapsis.com or email hr@neohapsis.com
sparc64 4.8 packages bulk build report

From: Landry Breuil (landryrhaalovely.net)
Date: Sun Aug 22 2010 - 07:45:41 CDT


Hi,

4.8 pkgs for sparc64 finished to build, so if anyone want to poke at
failures... here's the raw list.

Landry

----- Forwarded message from Landry Breuil <landrysparc64-1.ports.openbsd.org> -----

Date: Sun, 22 Aug 2010 06:24:48 -0600 (MDT)
From: Landry Breuil <landrysparc64-1.ports.openbsd.org>
To: landryrhaalovely.net
Subject: sparc64 bulk build report
Message-Id: <201008221224.o7MCOmJ6007648sparc64-1.ports.openbsd.org>

bulk build on sparc64-1.ports.openbsd.org finished at Sat Aug 21 21:23:31 MDT 2010 , started on Mon Aug 16 11:10:02 MDT 2010
done with kern.version=OpenBSD 4.8 (GENERIC) #85: Mon Aug 9 12:05:43 MDT 2010

built packages:6061
Aug 16:138
Aug 17:777
Aug 18:700
Aug 19:1838
Aug 20:1442
Aug 21:1165

build failures: 24
http://rhaalovely.net/build-failures//sparc64/4.8/cad/chipmunk.log
http://rhaalovely.net/build-failures//sparc64/4.8/comms/xastir.log
http://rhaalovely.net/build-failures//sparc64/4.8/devel/sdcc.log
Those are asm problem, probably since gcc4 switch (built on 22/05,
fails since 30/05)
http://rhaalovely.net/build-failures//sparc64/4.8/devel/arm-elf/newlib.log
as: unrecognized option `-mfpu=softfpa' -> iirc this one never built

http://rhaalovely.net/build-failures//sparc64/4.8/devel/gobject-introspection.log
New failure, SIGBUS, fallout of a recent update. ajacoutot is working
on it, but nothing depends on this port yet.

http://rhaalovely.net/build-failures//sparc64/4.8/devel/haddock,no_deps.log
http://rhaalovely.net/build-failures//sparc64/4.8/devel/haddock,no_deps,-lib.log
http://rhaalovely.net/build-failures//sparc64/4.8/devel/haddock,no_deps,-main.log
dpb known failure

http://rhaalovely.net/build-failures//sparc64/4.8/devel/mico.log
fixed.cc:303: error: 'fmodl' was not declared in this scope
fixed.cc:306: error: 'ceill' was not declared in this scope
fixed.cc:308: error: 'floorl' was not declared in this scope
Fallout of gcc4 switch ? fails since 30/05

http://rhaalovely.net/build-failures//sparc64/4.8/devel/qt4-eventsview.log
known broken since qt 4.6 update

http://rhaalovely.net/build-failures//sparc64/4.8/emulators/vba.log
OOM during build

http://rhaalovely.net/build-failures//sparc64/4.8/games/lostpixels.log
Asm error, fails since 05/06

http://rhaalovely.net/build-failures//sparc64/4.8/games/scummvm.log
Asm error, fails since 23/07

http://rhaalovely.net/build-failures//sparc64/4.8/graphics/aqsis.log
build/shadercompiler/slxargs/libslxargs.so.1.0: undefined reference to `pthread_mutex_unlock'
build/shadercompiler/slxargs/libslxargs.so.1.0: undefined reference to `pthread_mutex_lock'
Fails since 30/05

http://rhaalovely.net/build-failures//sparc64/4.8/lang/STk.log
mpn_dm_1.c:125: error: lvalue required in asm statement
mpn_dm_1.c:125: error: invalid lvalue in asm output 1
Never built

http://rhaalovely.net/build-failures//sparc64/4.8/lang/gcc/3/3,-ada.log
cp: paths/lang/gcc/3/3,-ada.log: No such file or directory
Fails since 23/07

http://rhaalovely.net/build-failures//sparc64/4.8/lang/jamvm.log
checking host system type... sparc64-unknown-openbsd4.8
configure: error: sparc64-unknown-openbsd4.8 not supported

http://rhaalovely.net/build-failures//sparc64/4.8/lang/unicon.log
../unicon/unicon -c qsort.icn
*** Signal 10
never built

http://rhaalovely.net/build-failures//sparc64/4.8/math/py-scipy.log
never built, various failures..
ICE during some fortran compilation or:
===> Verifying specs: umfpack arpack umfpack arpack amd blas lapack m
g2c amd blas lapack m g2c
Missing library for amd.>=0.0

http://rhaalovely.net/build-failures//sparc64/4.8/net/avahi,-mono.log
http://rhaalovely.net/build-failures//sparc64/4.8/net/avahi,-qt4.log
http://rhaalovely.net/build-failures//sparc64/4.8/net/avahi,no_gtk,no_qt3,no_qt4,-mono.log
Dpb failure ?

http://rhaalovely.net/build-failures//sparc64/4.8/textproc/source-highlight.log
source-highlight.o(.text+0x1a34): In function `main': undefined reference to `pthread_mutex_lock'
source-highlight.o(.text+0x1a4c): In function `main': undefined reference to `pthread_mutex_unlock'
Fails since 30/05, gcc4 fallout ?

http://rhaalovely.net/build-failures//sparc64/4.8/x11/e17/e.log
/usr/local/bin/edje_cc -v -id ../../data/themes/images -fd
../../data/themes/fonts -DLOWRES_PDA=1 -DMEDIUMRES_PDA=2 -DHIRES_PDA=3
-DSLOW_PC=4 -DMEDIUM_PC=5 -DFAST_PC=6 -DE17_PROFILE=SLOW_PC \
        ../../data/themes/default.edc \
        ../../data/themes/default.edj
/usr/local/bin/edje_cc: Error. Unable to open
"../../data/themes/default.edj" for writing output
/usr/local/bin/edje_cc: Opening "/tmp/edje_cc.edc-tmp-xv76Xe" for input

Never built