OSEC

Neohapsis is currently accepting applications for employment. For more information, please visit our website www.neohapsis.com or email hr@neohapsis.com
hppa 4.8 packages bulk build report

From: Landry Breuil (landryrhaalovely.net)
Date: Wed Sep 01 2010 - 03:11:17 CDT


Hi,

here's the usual report, comments on failures inline, anyone welcome to
work on it :
--------------------
bulk build on hppa.ports.openbsd.org finished at Tue Aug 17 02:37:33 MDT 2010 , started on Mon Aug 30 21:46:28 MDT 2010
done with kern.version=OpenBSD 4.8 (GENERIC) #81: Mon Aug 9 12:04:10 MDT 2010

built packages:5746
Aug 17:228
Aug 18:247
Aug 19:272
Aug 20:69
Aug 21:153
Aug 22:40
Aug 23:246
Aug 24:472
Aug 25:288
Aug 26:883
Aug 27:994
Aug 28:660
Aug 29:557
Aug 30:636

build failures: 54
http://rhaalovely.net/build-failures//hppa/2010-08-17/converters/libpst.log
/usr/bin/ld:
.libs/python-libpst.o(.gnu.linkonce.t._ZNK5boost6python18to_python_indirectIRP22pst_item_message_storeNS0_6detail21make_reference_holderEE7executeIS2_EEP7_objectPT_N4mpl_5bool_ILb1EEE+0x54):
cannot reach
00001223__ZNK5boost6python18to_python_indirectIRP22pst_item_message_storeNS0_6detail21make_reference_holderEE7executeIS2_EEP7_objectRKT_N4mpl_5bool_ILb0EEE+0,
recompile with -ffunction-sections
/usr/bin/ld:
.libs/python-libpst.o(.gnu.linkonce.t._ZNK5boost6python18to_python_indirectIRP22pst_item_message_storeNS0_6detail21make_reference_holderEE7executeIS2_EEP7_objectPT_N4mpl_5bool_ILb1EEE+0x54):
cannot handle R_PARISC_PCREL17F for _object*
boost::python::to_python_indirect<pst_item_message_store*&,
boost::python::detail::make_reference_holder>::execute<pst_item_message_store>(pst_item_message_store
const&, mpl_::bool_<false>) const
/usr/bin/ld: final link failed: Bad value

ld/boost/binutils issue ?

http://rhaalovely.net/build-failures//hppa/2010-08-17/devel/cln.log
Goes into an infinite loop at some point ?

http://rhaalovely.net/build-failures//hppa/2010-08-17/devel/haddock,no_deps.log
http://rhaalovely.net/build-failures//hppa/2010-08-17/devel/haddock,no_deps,-lib.log
http://rhaalovely.net/build-failures//hppa/2010-08-17/devel/haddock,no_deps,-main.log
Dpb issue

http://rhaalovely.net/build-failures//hppa/2010-08-17/devel/mico.log
Known broken, jasper would like to remove it if noone fixes it

http://rhaalovely.net/build-failures//hppa/2010-08-17/devel/openmpi.log
checking prefix for global symbol labels... none
configure: error: Could not determine global symbol label prefix

http://rhaalovely.net/build-failures//hppa/2010-08-17/devel/py-ctypes.log
configure: error: "libffi has not been ported to hppa-unknown-openbsd4.8."
'someone' should backport the libffi configure fixes done in devel/libffi

http://rhaalovely.net/build-failures//hppa/2010-08-17/devel/qt4-eventsview.log
Known broken

http://rhaalovely.net/build-failures//hppa/2010-08-17/editors/emacs22.log
http://rhaalovely.net/build-failures//hppa/2010-08-17/editors/emacs22,-el.log
http://rhaalovely.net/build-failures//hppa/2010-08-17/editors/emacs22,-main.log
http://rhaalovely.net/build-failures//hppa/2010-08-17/editors/emacs22,gtk.log
http://rhaalovely.net/build-failures//hppa/2010-08-17/editors/emacs22,gtk,-el.log
http://rhaalovely.net/build-failures//hppa/2010-08-17/editors/emacs22,gtk,-main.log
http://rhaalovely.net/build-failures//hppa/2010-08-17/editors/emacs22,no_x11.log
http://rhaalovely.net/build-failures//hppa/2010-08-17/editors/emacs22,no_x11,-el.log
http://rhaalovely.net/build-failures//hppa/2010-08-17/editors/emacs22,no_x11,-main.log
Who gives a shit about emacs ?
Srsly, asm error :
{standard input}:1626: Error: bad expression
{standard input}:1626: Error: bad expression
{standard input}:1626: Error: bad expression
{standard input}:1626: Error: bad expression
{standard input}:1626: Error: Invalid operands

http://rhaalovely.net/build-failures//hppa/2010-08-17/emulators/dosbox.log
mpu401.cpp:42: error: expected identifier before numeric constant
mpu401.cpp:42: error: expected `}' before numeric constant
mpu401.cpp:42: error: expected unqualified-id before numeric constant
mpu401.cpp:42: error: expected declaration before '}' token

http://rhaalovely.net/build-failures//hppa/2010-08-17/emulators/vba.log
OOM

http://rhaalovely.net/build-failures//hppa/2010-08-17/games/allegro.log
./src/x/xdga2s.s: Assembler messages:
./src/x/xdga2s.s:25: Error: symbol `.text' is already defined

http://rhaalovely.net/build-failures//hppa/2010-08-17/games/neverball.log
http://rhaalovely.net/build-failures//hppa/2010-08-17/games/neverball,-data.log
http://rhaalovely.net/build-failures//hppa/2010-08-17/games/neverball,-main.log
gmake: *** [data/ball/snowglobe/snowglobe-inner.sol] Illegal instruction
(core dumped)

http://rhaalovely.net/build-failures//hppa/2010-08-17/games/xboing.log
http://rhaalovely.net/build-failures//hppa/2010-08-17/games/xmris.log
already fixed by jasper iirc
http://rhaalovely.net/build-failures//hppa/2010-08-17/graphics/aqsis.log
build/shadercompiler/slxargs/libslxargs.so.1.0: undefined reference to
`pthread_mutex_unlock'
build/shadercompiler/slxargs/libslxargs.so.1.0: undefined reference to
`pthread_mutex_lock'

http://rhaalovely.net/build-failures//hppa/2010-08-17/graphics/enblend-enfuse.log
/usr/bin/ld:
enblend-enblend.o(.gnu.linkonce.t._ZNK5vigra15CachedFileImageINS_8RGBValueIjLj0ELj1ELj2EEEE11initTmpfileEv+0x130):
cannot reach 00000b30_mkstemp+0, recompile with -ffunction-sections
/usr/bin/ld:
enblend-enblend.o(.gnu.linkonce.t._ZNK5vigra15CachedFileImageINS_8RGBValueIjLj0ELj1ELj2EEEE11initTmpfileEv+0x130):
cannot handle R_PARISC_PCREL17F for mkstemp
/usr/bin/ld: final link failed: Bad value

http://rhaalovely.net/build-failures//hppa/2010-08-17/graphics/s10sh.log
bytesex.h:18:3: error: #error can not find the byte order for this
architecture, fix bytesex.h
main.c:584:2: error: #error Please, define byte sex

http://rhaalovely.net/build-failures//hppa/2010-08-17/graphics/xbmbrowser.log
already fixed by jasper ?

http://rhaalovely.net/build-failures//hppa/2010-08-17/lang/ecl.log
Infinite loop at some point

http://rhaalovely.net/build-failures//hppa/2010-08-17/lang/scm.log
./scmlit -fr4rstest.scm -e'(test-sc4)(test-delay)(gc)' -e '(or (null?
errs) (quit 1))'
add
#define STACK_GROWS_UP
in setjump.h and recompile scm

http://rhaalovely.net/build-failures//hppa/2010-08-17/mail/tkrat.log
/usr/local/bin/tclsh8.4:/usr/ports/pobj/tkrat-2.1.2p2/tkrat-2.1.2/util/blt_busy.so.1.0:
undefined symbol '$$dyncall'
/usr/local/bin/tclsh8.4:./blt_busy.so.1.0: undefined symbol '$$dyncall'
couldn't load file "./blt_busy.so.1.0": Cannot load specified object

tcl issue ?

http://rhaalovely.net/build-failures//hppa/2010-08-17/math/py-scipy.log
scipy/integrate/quadpack/dqmomo.f:126: internal compiler error:
Segmentation fault

known ICE ?

http://rhaalovely.net/build-failures//hppa/2010-08-17/misc/xnc.log
c++ -o libxncfive.so fiveplugin.o fivegeom.o fivefuncs.o fiveskin.o
fivegui.o fivepanel.o xncinifive.o ../common/iplugin.o -shared -fpic
-Wl,-b
/usr/bin/ld: invalid BFD target `--library=stdc++'

http://rhaalovely.net/build-failures//hppa/2010-08-17/misc/xtar.log
<command-line>: error: missing '(' after predicate

http://rhaalovely.net/build-failures//hppa/2010-08-17/net/avahi,-mono.log
http://rhaalovely.net/build-failures//hppa/2010-08-17/net/avahi,-qt4.log
http://rhaalovely.net/build-failures//hppa/2010-08-17/net/avahi,no_gtk,no_qt3,no_qt4,-mono.log
dpb issue

http://rhaalovely.net/build-failures//hppa/2010-08-17/net/tightvnc.log
http://rhaalovely.net/build-failures//hppa/2010-08-17/net/tightvnc,-main.log
http://rhaalovely.net/build-failures//hppa/2010-08-17/net/tightvnc,-viewer.log
mfbtewhite.c: In function 'mfbTEGlyphBltWhite':
mfbtewhite.c:235: error: expected '=', ',', ';', 'asm' or
'__attribute__' before 'char1'
mfbtewhite.c:235: error: 'char1' undeclared (first use in this function)
mfbtewhite.c:235: error: (Each undeclared identifier is reported only
once
mfbtewhite.c:235: error: for each function it appears in.)
mfbtewhite.c:235: error: 'char2' undeclared (first use in this function)
mfbtewhite.c:235: error: 'char3' undeclared (first use in this function)
mfbtewhite.c:235: error: 'char4' undeclared (first use in this function)
mfbtewhite.c:317: error: 'glyphPointer' undeclared (first use in this
function)

http://rhaalovely.net/build-failures//hppa/2010-08-17/net/xorp.log
http://rhaalovely.net/build-failures//hppa/2010-08-17/net/xorp,-main.log
/usr/include/g++/bits/basic_string.h:288: warning: cast from 'char*' to
'std::basic_string<char, std::char_traits<char>, std::allocator<char>
>::_Rep*' increases required alignment of target type

warning on cast + Werror ?
http://rhaalovely.net/build-failures//hppa/2010-08-17/sysutils/rsyslog.log
http://rhaalovely.net/build-failures//hppa/2010-08-17/sysutils/rsyslog,-main.log
http://rhaalovely.net/build-failures//hppa/2010-08-17/sysutils/rsyslog,-mysql.log
http://rhaalovely.net/build-failures//hppa/2010-08-17/sysutils/rsyslog,-pgsql.log
/usr/ports/pobj/rsyslog-4.6.3/rsyslog-4.6.3/runtime/wtp.c:219: undefined
reference to `ATOMIC_STORE_0_TO_INT'
/usr/ports/pobj/rsyslog-4.6.3/rsyslog-4.6.3/runtime/wti.c:149: undefined
reference to `ATOMIC_CAS_VAL'

new failure... steven ?

http://rhaalovely.net/build-failures//hppa/2010-08-17/textproc/source-highlight.log
source-highlight.o(.text+0x5be0): In function `main':
: undefined reference to `pthread_mutex_lock'
source-highlight.o(.text+0x5bf4): In function `main':
: undefined reference to `pthread_mutex_unlock'
missing -pthread ?

http://rhaalovely.net/build-failures//hppa/2010-08-17/www/amaya/browser.log
configure: error: Could not find the -lz library. You must first
install zlib.
Weird .. probably a autohell issue

http://rhaalovely.net/build-failures//hppa/2010-08-17/www/netsurf/libcss.log
src/stylesheet.c:269: warning: cast increases required alignment of
target type
cast+werror. gotta work with upstream on it.

http://rhaalovely.net/build-failures//hppa/2010-08-17/x11/e17/e.log
/usr/local/bin/edje_cc: Error. Cannot create buffer engine canvas for
image load.
never built

http://rhaalovely.net/build-failures//hppa/2010-08-17/x11/emiclock.log
/usr/bin/ld: cannot find -lAlib

http://rhaalovely.net/build-failures//hppa/2010-08-17/x11/tint.log
/usr/ports/pobj/tint-0.11/tint2-0.11/src/battery/battery.c:28:28: error:
machine/apmvar.h: No such file or directory

ONLY_FOR_ARCHS=${APM_ARCHS}

Landry